Jenkins Blog

Skip to end of sidebar Go to start of sidebar

Hi Everyone!!!

Is there any Jenkins plugin such that if directory <XXX>, in SVN folder <GoRoCo>, is present then the <GoRoCo>_<XXX> Jenkins job is called ???

OR

Is it possible with BUILD FLOW plugin???

Thanks,

Rohan Shetty

Maven BUILD FAILURE

Hi,

I am getting this error in jenkins build. Can someone help?

[INFO]                                                                        
[INFO] ------------------------------------------------------------------------
[INFO] Building PIP Projects 20120423.1-2.1.27
[INFO] ------------------------------------------------------------------------
[INFO]
[INFO] -- maven-release-plugin:2.2:clean (default-cli) @ pip --
[INFO] Cleaning up after release...
[INFO]
[INFO] -- maven-release-plugin:2.2:prepare (default-cli) @ pip --
[INFO] The SCM URL contains unused parameter : PIP_FINAL_V1R1_Int
[INFO] ------------------------------------------------------------------------
[INFO] Reactor Summary:
[INFO]
[INFO] PIP Projects ...................................... FAILURE [0.797s]
[INFO] PIP Glue .......................................... SKIPPED
[INFO] PIP ESB Clients ................................... SKIPPED
[INFO] PIP CIM Client .................................... SKIPPED
[INFO] PIP Common Address Client ......................... SKIPPED
[INFO] PIP Correspondence Client ......................... SKIPPED
[INFO] PIP PDS Client .................................... SKIPPED
[INFO] PIP Client ........................................ SKIPPED
[INFO] PIP S46E Client ................................... SKIPPED
[INFO] PIP Reports ....................................... SKIPPED
[INFO] PIP TEST .......................................... SKIPPED
[INFO] PNIP PIP CLIENT ................................... SKIPPED
[INFO] PIP EJB Service Layer ............................. SKIPPED
[INFO] PIP WEB EXT ....................................... SKIPPED
[INFO] PIP WEB INT ....................................... SKIPPED
[INFO] APP_PIP_EXT ....................................... SKIPPED
[INFO] APP_PIP_INT ....................................... SKIPPED
[INFO] ------------------------------------------------------------------------
[INFO] BUILD FAILURE
[INFO] ------------------------------------------------------------------------
[INFO] Total time: 1.531s
[INFO] Finished at: Thu Apr 26 10:42:49 EST 2012
[INFO] Final Memory: 8M/25M
[INFO] ------------------------------------------------------------------------
[ERROR] Failed to execute goal org.apache.maven.plugins:maven-release-plugin:2.2:prepare (default-cli) on project pip: You don't have a SNAPSHOT project in the reactor projects list. -> [Help 1]
[ERROR]
[ERROR] To see the full stack trace of the errors, re-run Maven with the -e switch.
[ERROR] Re-run Maven using the -X switch to enable full debug logging.
[ERROR]
[ERROR] For more information about the errors and possible solutions, please read the following articles:
[ERROR] [Help 1] http://cwiki.apache.org/confluence/display/MAVEN/MojoFailureException
Build step 'Invoke top-level Maven targets' marked build as failure
Finished: FAILURE

I have been using the following maven version for my jenkins plug-in development.

Apache Maven 3.0.4 (r1232337; 2012-01-17 09:44:56+0100)
Maven home: C:\Program Files\Apache Software Foundation\apache-maven-3.0.4\apache-maven-3.0.4
Java version: 1.7.0_03, vendor: Oracle Corporation
Java home: C:\Program Files\Java\jdk1.7.0_03\jre
Default locale: en_US, platform encoding: Cp1252
OS name: "windows xp", version: "5.1", arch: "x86", family: "windows"

Now in executing "mvn package", the following errors are being popping up:

Downloaded: http://repo.jenkins-ci.org/public/org/codehaus/plexus/plexus-utils/2.0.5/plexus-utils-2.0.5.jar (218 KB at 119.2 KB/sec)
[INFO] Using 'UTF-8' encoding to copy filtered resources.
[INFO] Copying 12 resources
[INFO]
[INFO] --- maven-hpi-plugin:1.67:apt-compile (default-apt-compile) @ xunit ---
[INFO] ------------------------------------------------------------------------
[INFO] BUILD FAILURE
[INFO] ------------------------------------------------------------------------
[INFO] Total time: 13:01.287s
[INFO] Finished at: Wed Apr 25 12:14:44 CEST 2012
[INFO] Final Memory: 12M/29M
[INFO] ------------------------------------------------------------------------
[ERROR] Failed to execute goal org.jenkins-ci.tools:maven-hpi-plugin:1.67:apt-compile (default-apt-compile) on project xunit: Execution default-apt-compile of goal org.jenkins-ci.tools:maven-hpi-plugin:1.67:apt-compile failed: A required class was missing while executing org.jenkins-ci.tools:maven-hpi-plugin:1.67:apt-compile: com/sun/mirror/apt/AnnotationProcessorFactory
[ERROR] -----------------------------------------------------
[ERROR] realm =    plugin>org.jenkins-ci.tools:maven-hpi-plugin:1.67
[ERROR] strategy = org.codehaus.plexus.classworlds.strategy.SelfFirstStrategy
[ERROR] urls[0] = file:/C:/Documents%20and%20Settings/snu5kor/.m2/repository/org/jenkins-ci/tools/maven-hpi-plugin/1.67/maven-hpi-plugin-1.67.jar
[ERROR] urls[1] = file:/C:/Documents%20and%20Settings/snu5kor/.m2/repository/org/apache/maven/maven-archiver/2.0.1/maven-archiver-2.0.1.jar
[ERROR] urls[2] = file:/C:/Documents%20and%20Settings/snu5kor/.m2/repository/org/codehaus/plexus/plexus-archiver/1.0-alpha-4/plexus-archiver-1.0-alpha-4.jar
[ERROR] urls[3] = file:/C:/Documents%20and%20Settings/snu5kor/.m2/repository/org/codehaus/plexus/plexus-utils/1.0.4/plexus-utils-1.0.4.jar
[ERROR] urls[4] = file:/C:/Documents%20and%20Settings/snu5kor/.m2/repository/org/mortbay/jetty/maven-jetty-plugin/6.1.1/maven-jetty-plugin-6.1.1.jar
[ERROR] urls[5] = file:/C:/Documents%20and%20Settings/snu5kor/.m2/repository/commons-el/commons-el/1.0/commons-el-1.0.jar
[ERROR] urls[6] = file:/C:/Documents%20and%20Settings/snu5kor/.m2/repository/org/mortbay/jetty/jetty/6.1.1/jetty-6.1.1.jar
[ERROR] urls[7] = file:/C:/Documents%20and%20Settings/snu5kor/.m2/repository/org/mortbay/jetty/jetty-util/6.1.1/jetty-util-6.1.1.jar
[ERROR] urls[8] = file:/C:/Documents%20and%20Settings/snu5kor/.m2/repository/org/mortbay/jetty/servlet-api-2.5/6.1.1/servlet-api-2.5-6.1.1.jar
[ERROR] urls[9] = file:/C:/Documents%20and%20Settings/snu5kor/.m2/repository/org/apache/maven/maven-plugin-tools-api/2.0/maven-plugin-tools-api-2.0.jar
[ERROR] urls[10] = file:/C:/Documents%20and%20Settings/snu5kor/.m2/repository/org/mortbay/jetty/jetty-plus/6.1.1/jetty-plus-6.1.1.jar
[ERROR] urls[11] = file:/C:/Documents%20and%20Settings/snu5kor/.m2/repository/javax/mail/mail/1.4/mail-1.4.jar
[ERROR] urls[12] = file:/C:/Documents%20and%20Settings/snu5kor/.m2/repository/javax/activation/activation/1.1/activation-1.1.jar
[ERROR] urls[13] = file:/C:/Documents%20and%20Settings/snu5kor/.m2/repository/geronimo-spec/geronimo-spec-jta/1.0.1B-rc4/geronimo-spec-jta-1.0.1B-rc4.jar
[ERROR] urls[14] = file:/C:/Documents%20and%20Settings/snu5kor/.m2/repository/ant/ant/1.6.5/ant-1.6.5.jar
[ERROR] urls[15] = file:/C:/Documents%20and%20Settings/snu5kor/.m2/repository/org/mortbay/jetty/jetty-naming/6.1.1/jetty-naming-6.1.1.jar
[ERROR] urls[16] = file:/C:/Documents%20and%20Settings/snu5kor/.m2/repository/org/mortbay/jetty/jetty-management/6.1.1/jetty-management-6.1.1.jar
[ERROR] urls[17] = file:/C:/Documents%20and%20Settings/snu5kor/.m2/repository/mx4j/mx4j/3.0.1/mx4j-3.0.1.jar
[ERROR] urls[18] = file:/C:/Documents%20and%20Settings/snu5kor/.m2/repository/mx4j/mx4j-tools/3.0.1/mx4j-tools-3.0.1.jar
[ERROR] urls[19] = file:/C:/Documents%20and%20Settings/snu5kor/.m2/repository/org/mortbay/jetty/jsp-2.1/6.1.1/jsp-2.1-6.1.1.jar
[ERROR] urls[20] = file:/C:/Documents%20and%20Settings/snu5kor/.m2/repository/org/eclipse/jdt/core/3.1.1/core-3.1.1.jar
[ERROR] urls[21] = file:/C:/Documents%20and%20Settings/snu5kor/.m2/repository/org/mortbay/jetty/jsp-api-2.1/6.1.1/jsp-api-2.1-6.1.1.jar
[ERROR] urls[22] = file:/C:/Documents%20and%20Settings/snu5kor/.m2/repository/org/apache/maven/plugins/maven-archetype-plugin/1.0-alpha-4/maven-archetype-plugin-1.0-alpha-4.jar
[ERROR] urls[23] = file:/C:/Documents%20and%20Settings/snu5kor/.m2/repository/org/apache/maven/archetype/maven-archetype-core/1.0-alpha-4/maven-archetype-core-1.0-alpha-4.jar
[ERROR] urls[24] = file:/C:/Documents%20and%20Settings/snu5kor/.m2/repository/org/codehaus/plexus/plexus-velocity/1.1.2/plexus-velocity-1.1.2.jar
[ERROR] urls[25] = file:/C:/Documents%20and%20Settings/snu5kor/.m2/repository/commons-collections/commons-collections/2.0/commons-collections-2.0.jar
[ERROR] urls[26] = file:/C:/Documents%20and%20Settings/snu5kor/.m2/repository/commons-logging/commons-logging-api/1.0.4/commons-logging-api-1.0.4.jar
[ERROR] urls[27] = file:/C:/Documents%20and%20Settings/snu5kor/.m2/repository/velocity/velocity/1.4/velocity-1.4.jar
[ERROR] urls[28] = file:/C:/Documents%20and%20Settings/snu5kor/.m2/repository/velocity/velocity-dep/1.4/velocity-dep-1.4.jar
[ERROR] urls[29] = file:/C:/Documents%20and%20Settings/snu5kor/.m2/repository/org/apache/maven/archetype/maven-archetype-creator/1.0-alpha-4/maven-archetype-creator-1.0-alpha-4.jar
[ERROR] urls[30] = file:/C:/Documents%20and%20Settings/snu5kor/.m2/repository/org/apache/maven/archetype/maven-archetype-model/1.0-alpha-4/maven-archetype-model-1.0-alpha-4.jar
[ERROR] urls[31] = file:/C:/Documents%20and%20Settings/snu5kor/.m2/repository/oro/oro/2.0.8/oro-2.0.8.jar
[ERROR] urls[32] = file:/C:/Documents%20and%20Settings/snu5kor/.m2/repository/org/codehaus/plexus/plexus-interactivity-api/1.0-alpha-4/plexus-interactivity-api-1.0-alpha-4.jar
[ERROR] urls[33] = file:/C:/Documents%20and%20Settings/snu5kor/.m2/repository/junit/junit/3.8.1/junit-3.8.1.jar
[ERROR] urls[34] = file:/C:/Documents%20and%20Settings/snu5kor/.m2/repository/plexus/plexus-utils/1.0.2/plexus-utils-1.0.2.jar
[ERROR] urls[35] = file:/C:/Documents%20and%20Settings/snu5kor/.m2/repository/org/kohsuke/stapler/maven-stapler-plugin/1.15/maven-stapler-plugin-1.15.jar
[ERROR] urls[36] = file:/C:/Documents%20and%20Settings/snu5kor/.m2/repository/org/kohsuke/stapler/stapler/1.100/stapler-1.100.jar
[ERROR] urls[37] = file:/C:/Documents%20and%20Settings/snu5kor/.m2/repository/commons-discovery/commons-discovery/0.4/commons-discovery-0.4.jar
[ERROR] urls[38] = file:/C:/Documents%20and%20Settings/snu5kor/.m2/repository/commons-logging/commons-logging/1.0.4/commons-logging-1.0.4.jar
[ERROR] urls[39] = file:/C:/Documents%20and%20Settings/snu5kor/.m2/repository/commons-beanutils/commons-beanutils/1.7.0/commons-beanutils-1.7.0.jar
[ERROR] urls[40] = file:/C:/Documents%20and%20Settings/snu5kor/.m2/repository/commons-io/commons-io/1.3.1/commons-io-1.3.1.jar
[ERROR] urls[41] = file:/C:/Documents%20and%20Settings/snu5kor/.m2/repository/org/jvnet/localizer/localizer/1.7/localizer-1.7.jar
[ERROR] urls[42] = file:/C:/Documents%20and%20Settings/snu5kor/.m2/repository/org/kohsuke/stapler/json-lib/2.1/json-lib-2.1-jdk15.jar
[ERROR] urls[43] = file:/C:/Documents%20and%20Settings/snu5kor/.m2/repository/commons-lang/commons-lang/2.3/commons-lang-2.3.jar
[ERROR] urls[44] = file:/C:/Documents%20and%20Settings/snu5kor/.m2/repository/net/sf/ezmorph/ezmorph/1.0.3/ezmorph-1.0.3.jar
[ERROR] urls[45] = file:/C:/Documents%20and%20Settings/snu5kor/.m2/repository/org/jvnet/tiger-types/1.1/tiger-types-1.1.jar
[ERROR] urls[46] = file:/C:/Documents%20and%20Settings/snu5kor/.m2/repository/commons-fileupload/commons-fileupload/1.2.1/commons-fileupload-1.2.1.jar
[ERROR] urls[47] = file:/C:/Documents%20and%20Settings/snu5kor/.m2/repository/org/apache/maven/reporting/maven-reporting-api/2.0.1/maven-reporting-api-2.0.1.jar
[ERROR] urls[48] = file:/C:/Documents%20and%20Settings/snu5kor/.m2/repository/org/apache/maven/doxia/doxia-sink-api/1.0-alpha-6/doxia-sink-api-1.0-alpha-6.jar
[ERROR] urls[49] = file:/C:/Documents%20and%20Settings/snu5kor/.m2/repository/commons-cli/commons-cli/1.0/commons-cli-1.0.jar
[ERROR] urls[50] = file:/C:/Documents%20and%20Settings/snu5kor/.m2/repository/qdox/qdox/1.6.1/qdox-1.6.1.jar
[ERROR] urls[51] = file:/C:/Documents%20and%20Settings/snu5kor/.m2/repository/org/apache/maven/plugins/maven-compiler-plugin/2.0.2/maven-compiler-plugin-2.0.2.jar
[ERROR] urls[52] = file:/C:/Documents%20and%20Settings/snu5kor/.m2/repository/org/codehaus/plexus/plexus-compiler-api/1.5.3/plexus-compiler-api-1.5.3.jar
[ERROR] urls[53] = file:/C:/Documents%20and%20Settings/snu5kor/.m2/repository/org/codehaus/plexus/plexus-compiler-javac/1.5.3/plexus-compiler-javac-1.5.3.jar
[ERROR] urls[54] = file:/C:/Documents%20and%20Settings/snu5kor/.m2/repository/org/codehaus/plexus/plexus-compiler-manager/1.5.3/plexus-compiler-manager-1.5.3.jar
[ERROR] urls[55] = file:/C:/Documents%20and%20Settings/snu5kor/.m2/repository/dom4j/dom4j/1.6.1/dom4j-1.6.1.jar
[ERROR] urls[56] = file:/C:/Documents%20and%20Settings/snu5kor/.m2/repository/xml-apis/xml-apis/1.0.b2/xml-apis-1.0.b2.jar
[ERROR] urls[57] = file:/C:/Documents%20and%20Settings/snu5kor/.m2/repository/org/jvnet/maven-jellydoc-plugin/maven-jellydoc-plugin/1.3/maven-jellydoc-plugin-1.3.jar
[ERROR] urls[58] = file:/C:/Documents%20and%20Settings/snu5kor/.m2/repository/org/jvnet/maven-jellydoc-plugin/jellydoc-annotations/1.3/jellydoc-annotations-1.3.jar
[ERROR] urls[59] = file:/C:/Documents%20and%20Settings/snu5kor/.m2/repository/org/jvnet/maven-jellydoc-plugin/taglib-xml-writer/1.3/taglib-xml-writer-1.3.jar
[ERROR] urls[60] = file:/C:/Documents%20and%20Settings/snu5kor/.m2/repository/com/sun/xml/txw2/txw2/20090102/txw2-20090102.jar
[ERROR] urls[61] = file:/C:/Documents%20and%20Settings/snu5kor/.m2/repository/net/java/dev/textile-j/textile-j/2.2.864/textile-j-2.2.864.jar
[ERROR] urls[62] = file:/C:/Documents%20and%20Settings/snu5kor/.m2/repository/nekohtml/nekohtml/1.9.6.2/nekohtml-1.9.6.2.jar
[ERROR] urls[63] = file:/C:/Documents%20and%20Settings/snu5kor/.m2/repository/org/apache/maven/reporting/maven-reporting-impl/2.0.1/maven-reporting-impl-2.0.1.jar
[ERROR] urls[64] = file:/C:/Documents%20and%20Settings/snu5kor/.m2/repository/commons-validator/commons-validator/1.1.4/commons-validator-1.1.4.jar
[ERROR] urls[65] = file:/C:/Documents%20and%20Settings/snu5kor/.m2/repository/org/apache/maven/doxia/doxia-core/1.0-alpha-6/doxia-core-1.0-alpha-6.jar
[ERROR] urls[66] = file:/C:/Documents%20and%20Settings/snu5kor/.m2/repository/org/apache/maven/doxia/doxia-site-renderer/1.0-alpha-6/doxia-site-renderer-1.0-alpha-6.jar
[ERROR] urls[67] = file:/C:/Documents%20and%20Settings/snu5kor/.m2/repository/org/codehaus/plexus/plexus-i18n/1.0-beta-6/plexus-i18n-1.0-beta-6.jar
[ERROR] urls[68] = file:/C:/Documents%20and%20Settings/snu5kor/.m2/repository/jaxen/jaxen/1.1.1/jaxen-1.1.1.jar
[ERROR] urls[69] = file:/C:/Documents%20and%20Settings/snu5kor/.m2/repository/jdom/jdom/1.0/jdom-1.0.jar
[ERROR] urls[70] = file:/C:/Documents%20and%20Settings/snu5kor/.m2/repository/xerces/xercesImpl/2.6.2/xercesImpl-2.6.2.jar
[ERROR] urls[71] = file:/C:/Documents%20and%20Settings/snu5kor/.m2/repository/xom/xom/1.0/xom-1.0.jar
[ERROR] urls[72] = file:/C:/Documents%20and%20Settings/snu5kor/.m2/repository/xerces/xmlParserAPIs/2.6.2/xmlParserAPIs-2.6.2.jar
[ERROR] urls[73] = file:/C:/Documents%20and%20Settings/snu5kor/.m2/repository/xalan/xalan/2.6.0/xalan-2.6.0.jar
[ERROR] urls[74] = file:/C:/Documents%20and%20Settings/snu5kor/.m2/repository/com/ibm/icu/icu4j/2.6.1/icu4j-2.6.1.jar
[ERROR] Number of foreign imports: 1
[ERROR] import: Entry[import  from realm ClassRealm[project>org.jenkins-ci.plugins:xunit:1.44-SNAPSHOT, parent: ClassRealm[maven.api, parent: null]]]
[ERROR]
[ERROR] -----------------------------------------------------: com.sun.mirror.apt.AnnotationProcessorFactory
[ERROR] -> [Help 1]
[ERROR]
[ERROR] To see the full stack trace of the errors, re-run Maven with the -e switch.
[ERROR] Re-run Maven using the -X switch to enable full debug logging.
[ERROR]
[ERROR] For more information about the errors and possible solutions, please read the following articles:
[ERROR] [Help 1] http://cwiki.apache.org/confluence/display/MAVEN/PluginContainerException

Please do let me know the solution.

Thanks in advance.

Jenkins plug-in creation

I have been getting the following error while doing "mvn package"

[INFO] Scanning for projects...
Downloading: http://repo.jenkins-ci.org/public/org/jenkins-ci/plugins/plugin/1.410/plugin-1.410.pom
Downloading: http://guice-maven.googlecode.com/svn/trunk/org/jenkins-ci/plugins/plugin/1.410/plugin-1.410.pom
Downloading: http://repo.maven.apache.org/maven2/org/jenkins-ci/plugins/plugin/1.410/plugin-1.410.pom
[ERROR] The build could not read 1 project -> [Help 1]
[ERROR]
[ERROR]   The project org.jenkins-ci.plugins:xunit:1.44-SNAPSHOT (C:\Sudhakar\MavenPlugins\jenkinsci-xunit-plugin-eca700
2\pom.xml) has 1 error
[ERROR]     Non-resolvable parent POM: Could not transfer artifact org.jenkins-ci.plugins:plugin:pom:1.410 from/to repo.
jenkins-ci.org (http://repo.jenkins-ci.org/public/): Not authorized by proxy, ReasonPhrase:Proxy Authentication Required
 ( Forefront TMG requires authorization to fulfill the request. Access to the Web Proxy filter is denied.  ). and 'paren
t.relativePath' points at wrong local POM @ line 4, column 13 -> [Help 2]
[ERROR]
[ERROR] To see the full stack trace of the errors, re-run Maven with the -e switch.
[ERROR] Re-run Maven using the -X switch to enable full debug logging.
[ERROR]
[ERROR] For more information about the errors and possible solutions, please read the following articles:
[ERROR] [Help 1] http://cwiki.apache.org/confluence/display/MAVEN/ProjectBuildingException
[ERROR] [Help 2] http://cwiki.apache.org/confluence/display/MAVEN/UnresolvableModelException

Can any one have idea about, How to resolve the above issue?

I'm getting a failure during/after artifact archive.  Any ideas anyone?

Archiving artifacts
Recording test results ERROR:
Failed to archive test reports hudson.util.IOException2: remote file operation failed: /var/jenkins/workspace/nightly_build at
hudson.remoting.Channel@1472998:mac_mini at hudson.FilePath.act(FilePath.java:781) at hudson.FilePath.act(FilePath.java:767) at hudson.tasks.junit.JUnitParser.parse(JUnitParser.java:83) at hudson.tasks.junit.JUnitResultArchiver.parse(JUnitResultArchiver.java:122) at hudson.tasks.junit.JUnitResultArchiver.perform(JUnitResultArchiver.java:134) at hudson.tasks.BuildStepMonitor$1.perform(BuildStepMonitor.java:19) at hudson.model.AbstractBuild$AbstractRunner.perform(AbstractBuild.java:693) at hudson.model.AbstractBuild$AbstractRunner.performAllBuildSteps(AbstractBuild.java:668) at hudson.model.AbstractBuild$AbstractRunner.performAllBuildSteps(AbstractBuild.java:646) at hudson.model.Build$RunnerImpl.post2(Build.java:162) at hudson.model.AbstractBuild$AbstractRunner.post(AbstractBuild.java:615) at hudson.model.Run.run(Run.java:1428) at hudson.model.FreeStyleBuild.run(FreeStyleBuild.java:46) at hudson.model.ResourceController.execute(ResourceController.java:88) at hudson.model.Executor.run(Executor.java:230) Caused by: java.io.IOException: Remote call on mac_mini failed at hudson.remoting.Channel.call(Channel.java:690) at hudson.FilePath.act(FilePath.java:774) ... 14 more Caused by: java.lang.NoClassDefFoundError: Could not initialize class hudson.tasks.junit.TestResult at hudson.tasks.junit.JUnitParser$ParseResultCallable.invoke(JUnitParser.java:114) at hudson.tasks.junit.JUnitParser$ParseResultCallable.invoke(JUnitParser.java:87) at hudson.FilePath$FileCallableWrapper.call(FilePath.java:2022) at hudson.remoting.UserRequest.perform(UserRequest.java:118) at hudson.remoting.UserRequest.perform(UserRequest.java:48) at hudson.remoting.Request$2.run(Request.java:287) at java.util.concurrent.Executors$RunnableAdapter.call(Executors.java:441) at java.util.concurrent.FutureTask$Sync.innerRun(FutureTask.java:303) at java.util.concurrent.FutureTask.run(FutureTask.java:138) at java.util.concurrent.ThreadPoolExecutor$Worker.runTask(ThreadPoolExecutor.java:886) at java.util.concurrent.ThreadPoolExecutor$Worker.run(ThreadPoolExecutor.java:908) at java.lang.Thread.run(Thread.java:680) Build step 'Publish JUnit test result report' changed build result to FAILURE

A great enhancement would be the ability to set a project based security where
by default users can't see any project. The permission to see/read the project
should be enabled explicitly in project security settings.below are the steps

1.go to Jenkins -- ManageJenkins -- configureSystem

user given permission to create a job not to view any job.

2.go to individual project

project -- configure -- check "enable project based security" 

user given permission to read jobs.

so he can see jobs cant delete,build and configure.

3.login as user ,and you can see only jobs assigned to you.

Classic Graphics recently setup a Jenkins environment to test our custom modules for Drupal that we use in support of our printing business.  We documented the entire process from installing the OS to a completed job with post-receive hooks.  We have shared this information with the community under the Creative Commons CC0 license.

http://www.slideshare.net/kg4san/drupal-continuous-integration-with-jenkins

We will be continually updating the document as we improve and add functionality to our processes and use of Jenkins in our development environment.

John W Smith
IT / IS Consultant
Classic Graphics, Inc
Charlotte, NC

User is unable to execute any selected option from the build ptions list. For example, if the user selects the "Execute shell" option from the build option list,the field will not be displayed. Any idea? Again I am using IE version 8 Please see the attachement

Build options are not displyed.pptx

In all Jenkins Jobs. When use is selecting the CollabNet Teamforge option for the repository browser and it should prompt the user to provide the valid credentials to the teamforgewhere. This log in form is missing in Jenkins job. I am using IE version 8 Please see the attachment.

Log in form is missing in CTF Browser.pptx

In all the Jenkins jobs I am configuring I have not see in the "Source Code Managments" area the variable name "Repository_depth_option" where you can select from the droping list the following options (infinity, empty, and immediate). Any idea? Please see the attachement I have included what I used to see in Hudson and what I am currently see in Jenkins. I am using IE version 8

Repository_depth_option.pptx

Build Notification Error

During my simple_ant_bad job configuration where I have purposly set the job to fail because I need the build to create an artifact in my "Build Notifications" tracker. The name is in the tracker list but for some reason I am wondering why jenkins keeps showing the error "The tracker is required" even the job was doing what is supposed to do? Please see the attachment. I am using IE version 8

Build Notification.pptx

Job Description Field

I am configuring a simple Ant job and I've noticed that the job description field did not display correctly, IThe field is shown with missing borders and I am using IE version 8. Please see the attachment.

Jenkins-display.jpg

Jenkins Issues

Here is list of Jenkins issues I have found using IE explorer.

Jenkins-Issues.xlsx

Perforce Plugin

Have multiple branches in perforce.

Want to only sync to the latest changelist specific to a branch (not the whole depot). 

 I've tried using the view mask option when syncing, however the sync happens to get the latest changelist from the entire depot?  Any thoughts on what I'm doing wrong?

Jenkins build error

Trying to build Jenkins from source from the instructions on the "Building Jenkins" page (https://wiki.jenkins-ci.org/display/JENKINS/Building+Jenkins)

>mvn clean install

stops with this error:

[ERROR] /var/test/jenkins/core/src/test/java/hudson/model/RunTest.java:[39,23] cannot find symbol
symbol  : constructor Artifact(java.lang.String,java.lang.String,java.lang.String,java.lang.String)

location: class hudson.model.Run<hudson.model.FreeStyleProject,hudson.model.FreeStyleBuild>.Artifact

[INFO] 1 error
[INFO] -------------------------------------------------------------
[INFO] ------------------------------------------------------------------------
[ERROR] BUILD FAILURE
[INFO] ------------------------------------------------------------------------
[INFO] Compilation failure

Can anybody give me a hint on this?

Thx