Bug Resolution in Jenkins and Oracle Hudson

Skip to end of metadata
Go to start of metadata

Overview

This page gives an overview over the bug resolution in Jenkins and Oracle Hudson.
It considers only bugs created before January 31, 2011 (that's the date when Jenkins got it's own JIRA).

Last Update: October 09, 2011

TODO

  • Add table for bugs that are "closed" in Jenkins but "open" in Oracle Hudson

Bugs that are "open" in Jenkins but "closed" in Oracle Hudson

571 JIRA issues are "Open", "In Progress" or "Reopened" in Jenkins, which are "Resolved", "Closed" or "Verified" in Hudson

JIRA Issue Number Summary JENKINS Status JENKINS Resolution HUDSON Status HUDSON Resolution
898 hudson detects changes when none for svn:external repo url Open Unresolved Resolved Cannot Reproduce
1215 OutOfMemoryError during SVN checkout Reopened Unresolved Resolved Cannot Reproduce
1241 force using HEAD SVN version for build Open Unresolved Verified Fixed
1324 No SVN update after previous 502 Bad Gateway error Open Unresolved Resolved Cannot Reproduce
1330 incorrect handling of multilevel subversion externals Open Unresolved Resolved Cannot Reproduce
1379 SVN credentials are keyed on hostname only Reopened Unresolved Verified Fixed
1394 Absolute path for Ant Build File does not work any more Reopened Unresolved Resolved Fixed
1481 Matrix Builds and Issue 1241 Open Unresolved Resolved Cannot Reproduce
1517 SVNkit "svn: Network connection closed unexpectedly" In Progress Unresolved Resolved Cannot Reproduce
1528 Findbugs plugin should be able to use external plugins. Reopened Unresolved Closed Duplicate
1607 game Expire points over time Open Unresolved Closed Won't Fix
1638 Adding CVS module entry after saving config has no effect Open Unresolved Resolved Cannot Reproduce
1646 Hudson hangup and poll never on CVS In Progress Unresolved Resolved Cannot Reproduce
1655 Allow way to configure rule set In Progress Unresolved Closed Won't Fix
1676 CVS password causes CVSSCM.isUpdatableModule() to yield incorrect result Open Unresolved Resolved Cannot Reproduce
1701 Execute another job first Open Unresolved Resolved Cannot Reproduce
1735 Add SOAP query to get web pages for MSBuild warnings Open Unresolved Closed Duplicate
1744 Please add code coverage plugin Open Unresolved Closed Won't Fix
1755 Add Most valued Build Open Unresolved Closed Won't Fix
1777 Canceling a batch task in the queue results in 404 error page Reopened Unresolved Resolved Fixed
1791 Hudson fails then looking at an access restricted revision in subversion Open Unresolved Resolved Cannot Reproduce
1843 Java source file URL incorrect in report Open Unresolved Closed Duplicate
1847 Removing file in cvs repository prevents build Open Unresolved Resolved Cannot Reproduce
1942 Xvnc plugin doesn't handle case where vnc executable isn't called vncserver Open Unresolved Closed Incomplete
1956 Tagging build to an existing tag causes SVN error Open Unresolved Resolved Cannot Reproduce
1960 OutOfMemoryError from CheckStyle plugin Reopened Unresolved Closed Duplicate
2001 SVN check out slow performance issue - REGRESSION 1.419 to 1.421 Reopened Unresolved Resolved Fixed
2002 Post-build Actions Build Other Projects order is not maintained Open Unresolved Resolved Cannot Reproduce
2073 SVN - Change credential does not work in project Open Unresolved Verified Fixed
2079 Allow users to see how points were derived (audit log) In Progress Unresolved Closed Won't Fix
2101 When behind Proxy: Processing PROPFIND request response failed: Premature end of file. Open Unresolved Resolved Cannot Reproduce
2154 Error generating documentation Reopened Unresolved Resolved Cannot Reproduce
2261 svn checkout issues when running via proxy Open Unresolved Resolved Cannot Reproduce
2270 Console page of broken build should have a "(re)build now" button Open Unresolved Verified Fixed
2319 Focus last visited tab if navigating back with the browser Open Unresolved Closed Duplicate
2320 Add paging for the detail tabs. Open Unresolved Closed Duplicate
2344 Subversion changes are listed multiple times Open Unresolved Verified Fixed
2345 CVS builds don't respond to updated module Open Unresolved Resolved Cannot Reproduce
2351 Moving Hudson to new server out of sync error Open Unresolved Resolved Cannot Reproduce
2445 SVN credentials are not read on "Reload from disk" Open Unresolved Resolved Cannot Reproduce
2452 Cannot install slave agent as Windows service Open Unresolved Closed Fixed
2468 monitor changes triggers builds too frequently for policy-core Open Unresolved Closed Cannot Reproduce
2501 Disable CAPTCHA option on signup Open Unresolved Resolved Won't Fix
2614 cvs update fails if there are non-ascii characters in filename In Progress Unresolved Resolved Cannot Reproduce
2631 Add support or parallel builds Open Unresolved Closed Duplicate
2637 AccuRev include/exclude rules are ignored Open Unresolved Closed Won't Fix
2638 CVS support needs multi-location support like Subversion Open Unresolved Resolved Duplicate
2651 Enhance email notification to optionally (per job) send email on success, not just failure or "back on track" Reopened Unresolved Resolved Incomplete
2668 Issue connecting to Subversion repository (works in Windows) Open Unresolved Resolved Cannot Reproduce
2691 CVS update should use checkout time of parent project Open Unresolved Resolved Cannot Reproduce
2696 AccuRev executable location is hardcoded Open Unresolved Closed Duplicate
2710 computing changelog is failing Open Unresolved Resolved Cannot Reproduce
2776 Show SupressWarnings directives of PMD report Open Unresolved Closed Duplicate
2780 Show all warnings of a single file Open Unresolved Closed Duplicate
2937 Artifact archive from Windows slave to Unix master fails Open Unresolved Resolved Cannot Reproduce
2961 Add a default player: 'The Team' In Progress Unresolved Closed Won't Fix
2962 Display a high score list instead of all users in the leader board In Progress Unresolved Closed Won't Fix
2989 hudson windows service is not restarted from update center after installing plugin Reopened Unresolved Resolved Fixed
3002 TFS Support to get labels Open Unresolved Closed Won't Fix
3023 Cobertura results not available after hudson restart Open Unresolved Resolved Cannot Reproduce
3036 Accurev Plugin: Support multiple streams Open Unresolved Closed Duplicate
3053 Unable to delete SCM files Open Unresolved Resolved Cannot Reproduce
3093 Cancelling a build loses the change history Open Unresolved Resolved Cannot Reproduce
3102 SubversionSCM only resolves parameters and not other variables Open Unresolved Resolved Cannot Reproduce
3113 Custom port in CVSROOT not recognized In Progress Unresolved Resolved Cannot Reproduce
3129 Show duplicate as a diff view Open Unresolved Closed Duplicate
3131 creating user throws com.octo.captcha.service.CaptchaServiceException: Invalid ID, could not validate unexisting or already validated captcha In Progress Unresolved Resolved Cannot Reproduce
3197 RFE: Use AccuRev server without doing logins Open Unresolved Closed Duplicate
3230 Parameter usable as value for SCM fields Open Unresolved Verified Fixed
3242 Classloader isolation of m2 build on tomcat. (JDK 1.5 m2 build on Tomcat 6 (JDK 1.6) on Ubuntu 8.10) Open Unresolved Resolved Cannot Reproduce
3262 Unexpected error in launching a slave (UnsupportedCharsetException: MacRoman) Open Unresolved Resolved Cannot Reproduce
3265 Reload Configuration from Disk loses info on running builds Open Unresolved Resolved Cannot Reproduce
3276 Wrong username used for login to SVN Open Unresolved Resolved Cannot Reproduce
3321 Make build quality depend on lines of code Open Unresolved Closed Duplicate
3336 enhance polling trigger cause reporting Open Unresolved Resolved Cannot Reproduce
3355 First checkout of project using SVN with module '.' prints stack trace Open Unresolved Resolved Cannot Reproduce
3375 Bad SVN exclusion regex cause jobs to never build Open Unresolved Resolved Cannot Reproduce
3380 Reboot of slavesystem does not take slave offline Open Unresolved Resolved Cannot Reproduce
3480 Can prune option (-P) on checkout be overridden Open Unresolved Resolved Cannot Reproduce
3481 Incorrect WebSVN path generation Open Unresolved Resolved Cannot Reproduce
3503 When svn+ssh credentials fail no UI feedback is given Open Unresolved Resolved Cannot Reproduce
3547 On Windows Vista slave: svn: No buffer space available In Progress Unresolved Resolved Cannot Reproduce
3575 authenticated users can modify their own scores Open Unresolved Closed Won't Fix
3580 Workspace deleted when subversion checkout happens Reopened Unresolved Verified Fixed
3636 Request to make retrieving sourcecode a configurable option when using SCM to poll for changes Open Unresolved Closed Won't Fix
3650 Specify minimum number of builds to keep when setting max days Open Unresolved Verified Fixed
3664 WMI slave instantiation error when using CNAME hostnames Open Unresolved Resolved Cannot Reproduce
3679 SVN input validation fails parameters Reopened Unresolved Resolved Cannot Reproduce
3734 Can't launch Windows slave via JNLP when Hudson authentication enabled Open Unresolved Resolved Duplicate
3744 Remoting infrastructure / bug in Java serialization Open Unresolved Resolved Cannot Reproduce
3748 builds in queue for long time get rearranged Open Unresolved Resolved Cannot Reproduce
3759 JNA does not delete temp files Open Unresolved Resolved Cannot Reproduce
3768 surefire problem w/o batch task Open Unresolved Resolved Cannot Reproduce
3776 Archiving artifacts should be skipped if the job was aborted Open Unresolved Resolved Cannot Reproduce
3785 Add option to perform labeling for each TFS build Open Unresolved Closed Won't Fix
3797 Deployment failing on JBoss 5.x Reopened Unresolved Resolved Cannot Reproduce
3799 Slave-to-master copies can be extremely slow Reopened Unresolved Closed Fixed
3807 git clone fails with repositories which require http auth Open Unresolved Resolved Cannot Reproduce
3815 Back to Project link does not work in opera when auto refreshing is enabled Open Unresolved Closed Won't Fix
3820 Master: too many open files / remote file operation failed because already closed Open Unresolved Resolved Cannot Reproduce
3824 Per-project matrix authorization strategy isn't accurate for newly created projects Open Unresolved Verified Fixed
3831 updates hang on download Open Unresolved Resolved Cannot Reproduce
3837 RunListener events are lost. Open Unresolved Resolved Cannot Reproduce
3848 cvs polling leaks file descriptors In Progress Unresolved Resolved Cannot Reproduce
3865 403 Error using SVN Open Unresolved Resolved Fixed
3889 EOFException on reconnect after network connection loss In Progress Unresolved Resolved Cannot Reproduce
3921 Node provisioning fails when only tied nodes available and untied jobs are waiting to run Open Unresolved Resolved Cannot Reproduce
3922 Slave is slow copying maven artifacts to master In Progress Unresolved Verified Duplicate
3924 Export the useSecurity field of Hudson via the XML API Reopened Unresolved Verified Fixed
3939 Downstream build failures not assigned to player Open Unresolved Closed Won't Fix
3942 Resolve job variables within Javadoc path location Reopened Unresolved Resolved Fixed
3966 Add option to clean workspace before each build Reopened Unresolved Verified Fixed
3979 CVS computing changelog broken Reopened Fixed Resolved Cannot Reproduce
3983 SMTP authentication not working Open Unresolved Resolved Cannot Reproduce
4008 Memory leak when building on slaves Reopened Unresolved Resolved Cannot Reproduce
4009 Queue length does not count jobs waiting for slaves Open Unresolved Resolved Cannot Reproduce
4031 Inconsistent revision numbers on concurrent commits. In Progress Unresolved Resolved Cannot Reproduce
4040 Autocomplete "Projects to build" under "Post-build Actions" Open Unresolved Verified Fixed
4046 Git does not work when $HOME is not set Open Unresolved Resolved Not A Defect
4054 NullPointerException by AccurevSCM while creating a new Job Open Unresolved Closed Duplicate
4088 Hudson temp command batch file on slave is sometimes missing. In Progress Unresolved Closed Fixed
4093 Ec2 plugin can take down hudson due to lack of error checking Open Unresolved Resolved Cannot Reproduce
4105 svn checkout throws after failing to get write lock In Progress Unresolved Resolved Cannot Reproduce
4108 Authors of issue-transactions get notified when a build fails. Open Unresolved Closed Duplicate
4140 Hudson on Tomcat with SSL does not allow zipped artifact downloads in IE In Progress Unresolved Resolved Cannot Reproduce
4150 Builds Are Aborted Without Cause or Interaction Open Unresolved Resolved Cannot Reproduce
4167 Fisheye viewer is ignorant of svn:externals property Open Unresolved Resolved Cannot Reproduce
4176 Reference counting error for RemotableSVNAuthenticationProviderImpl singleton Reopened Unresolved Resolved Cannot Reproduce
4185 Hudson is crashing Glassfish AS 2.1 after pressing restart button In Progress Unresolved Resolved Cannot Reproduce
4207 LC_ALL=cs_CZ.ISO8859-2 on solaris 9 In Progress Unresolved Resolved Cannot Reproduce
4215 NPE during test run Open Unresolved Resolved Cannot Reproduce
4224 Slave changes hash code when its name changes Open Unresolved Resolved Cannot Reproduce
4227 patch to use cvs update of releases with submodules on different branches Reopened Unresolved Resolved Cannot Reproduce
4241 CVS CSM implementation change CVS/Entries files encoding Open Unresolved Resolved Cannot Reproduce
4247 Hudson "build now" link violates RFC 2616 Open Unresolved Resolved Cannot Reproduce
4289 Hudson subversion checkout causes files to appear modified if they have no revision history Open Unresolved Resolved Cannot Reproduce
4311 Hudson fails build upon failure to delete a target folder Open Unresolved Resolved Cannot Reproduce
4327 Add automatic installation support for binaries Open Unresolved Closed Won't Fix
4328 Make it possible to remove a build's score card from the users score Open Unresolved Closed Won't Fix
4334 job config change gets exception: This page expects a form submission Open Unresolved Resolved Cannot Reproduce
4336 support loadLibrary over remoting Open Unresolved Resolved Cannot Reproduce
4340 SVN Fails due to inability to get a "Credential" Open Unresolved Resolved Cannot Reproduce
4349 Wrong https port available detection Open Unresolved Resolved Cannot Reproduce
4354 Make Hudson user names case insensitive Reopened Unresolved Resolved Fixed
4360 PowerPC Mac not supported Open Unresolved Resolved Cannot Reproduce
4363 While executing maven release plugin, an error is being thrown when verifying that there are no local modifications. Open Unresolved Resolved Cannot Reproduce
4369 Workspace relocation check false positivities Open Unresolved Closed Duplicate
4390 Hudson hangs on archiving Open Unresolved Resolved Fixed
4403 batch CMD windows are not visible Open Unresolved Resolved Cannot Reproduce
4404 Invalid chunk ignored Open Unresolved Resolved Cannot Reproduce
4409 Hudson test case leaks temp folders Open Unresolved Resolved Cannot Reproduce
4422 Previous built branch builds again even if removed Reopened Unresolved Resolved Cannot Reproduce
4431 remote file operation failed because of OutOfMemoryError In Progress Unresolved Resolved Cannot Reproduce
4433 log4j upgrade to version 1.2.12 or later Open Unresolved Verified Fixed
4437 Should be able to select project JDK when only one JDK entered in hudson config Open Unresolved Resolved Cannot Reproduce
4463 Currently logged in user should be available as environment variable Reopened Unresolved Verified Fixed
4489 workspace doesn't change when cvs project does Open Unresolved Resolved Cannot Reproduce
4501 WorkspaceCleanupThread deletes Matrix project workspaces Open Unresolved Resolved Cannot Reproduce
4505 Build publishers run for aborted build Open Unresolved Resolved Fixed
4542 Support multiple source paths Open Unresolved Closed Won't Fix
4554 auth errors from interactions with 1.6.5 Open Unresolved Resolved Cannot Reproduce
4567 Hudson does not use the credentials stored in the subversion profile Open Unresolved Verified Cannot Reproduce
4586 Smtp authentication cannot be saved Reopened Unresolved Verified Cannot Reproduce
4597 Hudson Upgrade succeeded, Jobs creation and saving fails Open Unresolved Resolved Cannot Reproduce
4604 Displaying CVS changelog history is broken Open Unresolved Resolved Cannot Reproduce
4605 Builds aborted during SVN update are marked as FAILURE Open Unresolved Verified Fixed
4613 Log message when svn URL is wrong could be better Open Unresolved Resolved Cannot Reproduce
4639 improve help tip: some special characters are removed in windows batch commands Open Unresolved Resolved Fixed
4647 Skip tests that depend on java.net if the website is down Open Unresolved Verified Fixed
4656 "Failed to join the process" upgrading to 1.328 or later on glassfish Open Unresolved Resolved Cannot Reproduce
4686 Build 328: Tomcat returns 404 Error When Using Python URLLIB library Open Unresolved Resolved Cannot Reproduce
4709 Add exclusion regions in TFS polling and checkout Open Unresolved Closed Won't Fix
4714 Login into hudson failed from IE6/8 (hudson own user database) Open Unresolved Resolved Cannot Reproduce
4727 svn error results in 200 failed builds Open Unresolved Resolved Cannot Reproduce
4733 svn change detected on slave fails build if master can't connect to repository Open Unresolved Resolved Cannot Reproduce
4743 Stopping Hudson on Windows under winestone stops not all processes Open Unresolved Resolved Cannot Reproduce
4747 Timer Task: NoClassDefFoundError: at hudson.model.Hudson.getComputer In Progress Unresolved Resolved Fixed
4750 SubversionSCM postCredential fails In Progress Unresolved Resolved Cannot Reproduce
4767 Client and Server triggers for SCM changes Open Unresolved Resolved Cannot Reproduce
4791 Concurrent Build Notation Not Friendly with SVN Open Unresolved Verified Fixed
4797 Locked files report plugin: Build blocked Open Unresolved Closed Won't Fix
4837 log file generated is UTF-8 (xcodebuild), not rendered right Open Unresolved Resolved Cannot Reproduce
4854 Multiple sub-paths Open Unresolved Closed Duplicate
4862 NullPointerException when using Subversion plugin with Apache+JBoss Open Unresolved Resolved Cannot Reproduce
4868 ConcurrentModificationException on startup Open Unresolved Closed Fixed
4888 Incorrect expiry HTTP header Open Unresolved Resolved Not A Defect
4923 Bad interaction between slave Windows installation and UAC Open Unresolved Resolved Cannot Reproduce
4926 Source code preview option Open Unresolved Closed Duplicate
4955 Native package documentation improvement Open Unresolved Closed Fixed
4966 updating rpm resets /var/log/hudson user and group Open Unresolved Resolved Cannot Reproduce
4975 Core compilation fails when JAVA_HOME contains space Open Unresolved Resolved Cannot Reproduce
4998 Not possible to download artifacts larger than 2GB Open Unresolved Resolved Not A Defect
5031 instant-messaging plugin notifications with custom messages Open Unresolved Closed Fixed
5036 Hudson fails to detect restricted security permission Open Unresolved Resolved Cannot Reproduce
5046 ZFS Migration Fail on Solaris b122 Open Unresolved Resolved Cannot Reproduce
5053 SocketTimeoutException after build start Reopened Unresolved Resolved Cannot Reproduce
5060 '/' is added incorrectly before '?' in WebSvn url Open Unresolved Verified Fixed
5084 WORKSPACE env variable is incorrect for matrix project on windows slaves Open Unresolved Verified Fixed
5096 java.io.EOFException disconnects all windows slaves Open Unresolved Resolved Fixed
5111 Problems with builds near to the day change - SVN doesn't update anything Open Unresolved Resolved Cannot Reproduce
5117 Subversion checkout of more than one folder results in Authentication Cancelled Error Open Unresolved Resolved Cannot Reproduce
5122 Using AccuRev account with no password causes OBF: to populate in the password field Open Unresolved Closed Duplicate
5125 "Block build when upstream is building" option is not working with multiple executors Open Unresolved Resolved Fixed
5153 SVN externals give SVNException during checkout Open Unresolved Resolved Cannot Reproduce
5175 Workspace not automatically reset when detecting a changed repository Open Unresolved Resolved Cannot Reproduce
5181 Unable to access ... svn: Handshake failed, received: Open Unresolved Resolved Cannot Reproduce
5202 Subversion polling is wrongly case-sensitive on URL's hostname Open Unresolved Resolved Cannot Reproduce
5203 NPE after upgrading git plugin (BuildData related) Open Unresolved Resolved Cannot Reproduce
5245 git recent changes doesn't follow reverse chronological order Open Unresolved Resolved Cannot Reproduce
5254 checkout fails with no log traffic when it lack access to write the checkout dir. Open Unresolved Resolved Cannot Reproduce
5261 Accurev populate, change history not synced. Open Unresolved Closed Duplicate
5287 hudson-test-harness tests hang, eventually fail Open Unresolved Resolved Cannot Reproduce
5289 Sventon and multiple SVN repositories causes repository browsing to fail Open Unresolved Resolved Cannot Reproduce
5301 Support Checkstyle severity Open Unresolved Closed Won't Fix
5316 X connection to localhost after maven site site:deploy Open Unresolved Resolved Cannot Reproduce
5320 java.net.SocketException when saving slave configuration Open Unresolved Resolved Cannot Reproduce
5324 jobs SCM changes + SCM polling don't work if workspace folder does not exist Open Unresolved Closed Duplicate
5336 Users are automatically created when going thru HUDSON_URL/user/anything Open Unresolved Verified Fixed
5362 Improve message for added tests Open Unresolved Closed Won't Fix
5384 Error starting slave via SSH - IOException: Remote sent corrupt MAC Open Unresolved Resolved Cannot Reproduce
5391 Dubious use of String.toUpperCase() Reopened Unresolved Resolved Cannot Reproduce
5408 Quoting Issue with JDK Installer with Windows Slave Open Unresolved Resolved Cannot Reproduce
5438 &lt scm&gt tag not exported by xml API Resolved Cannot Reproduce
5472 The directory given with --webroot is cleaned if it already exists, even with existing files Open Unresolved Resolved Cannot Reproduce
5475 Stale git lock if hudson is interrupted while cloning Open Unresolved Resolved Cannot Reproduce
5497 OutOfMemoryError: GC overhead limit exceeded Open Unresolved Resolved Cannot Reproduce
5512 SCM trigger tries to check out forever when SCM is corrupted Open Unresolved Resolved Not A Defect
5514 Hudson started some sort of cleanup of custom workspace before job completed Open Unresolved Resolved Cannot Reproduce
5519 IndexOutOfBoundsException when building maven project in Hudson with incompatible java source version Reopened Unresolved Resolved Fixed
5533 Support renaming in SCM changelog Open Unresolved Resolved Not A Defect
5539 Extend Project-based Matrix Authorization Strategy with SCM Configuration option Open Unresolved Verified Fixed
5556 Hudson slave node stuck doing a zip-up Open Unresolved Resolved Cannot Reproduce
5580 Environment variables from setenv plugin are not inherited/parsed by batch tasks Reopened Unresolved Resolved Fixed
5609 Git Polling Errors Can Crash the Polling Thread Open Unresolved Resolved Cannot Reproduce
5620 Hudson can't detect UTF-16 encoding for HTML files in workspace. Open Unresolved Resolved Cannot Reproduce
5624 Remoting does not retrieve resources in locally pre-fetched JARs Open Unresolved Verified Fixed
5650 Wrong charset entry in build.xml after hudson-Upgrade Reopened Unresolved Resolved Cannot Reproduce
5665 NoClassDefFound Exception Open Unresolved Resolved Cannot Reproduce
5674 Some NUnit test results show blank "Test name" attribute in web view Reopened Unresolved Closed Won't Fix
5676 git tag cannot be disabled overrides the existing version Open Unresolved Verified Fixed
5677 git scm does not detect changes on master branch of upstream repo Open Unresolved Resolved Cannot Reproduce
5694 svn polling error does not stop subsequent scheduled polling Open Unresolved Resolved Cannot Reproduce
5699 Terminate when HTTP port bind fails Open Unresolved Resolved Not A Defect
5701 FastPipedInput/OutputStream and deadlock Open Unresolved Resolved Cannot Reproduce
5702 Update runtime hudson model after dynamically "updating" an existing job Open Unresolved Resolved Cannot Reproduce
5710 Publish game points in email Open Unresolved Closed Won't Fix
5714 Additional options for tfs plugin such as overwrite and forced Open Unresolved Closed Won't Fix
5717 No valid crumb on manual build request Open Unresolved Resolved Cannot Reproduce
5730 Dispatch transactions trigger a build Open Unresolved Closed Duplicate
5744 Polling not working as intended using CVS Open Unresolved Resolved Cannot Reproduce
5750 SVNAuthenticationException while estimating the SVN server's timestamp Open Unresolved Resolved Cannot Reproduce
5771 Debian package upgrade sets wrong user permissions if HUDSON_USER is not hudson (default) Open Unresolved Resolved Cannot Reproduce
5797 hudson debian package depends on default-jre but that brings in GUI libraries Open Unresolved Verified Fixed
5818 Mixed Spring jar versions (2.5 and 1.2.9) in hudson.war package Open Unresolved Verified Fixed
5819 Score card does not take fixed findbugs into account Reopened Unresolved Closed Fixed
5830 Git configuration is not read during polling if the project has never been built on master Open Unresolved Resolved Cannot Reproduce
5843 Environments variables created by the parametrized build are not converted to all uppercase anymore Open Unresolved Resolved Cannot Reproduce
5856 Unable to Release a Git Project Reopened Unresolved Resolved Cannot Reproduce
5888 Invalid git url results in a 500 and a URISyntaxException stacktrace to the client Open Unresolved Resolved Cannot Reproduce
5891 Create job with downstream project by remote api doesn't work Open Unresolved Resolved Cannot Reproduce
5909 JVM heap options cannot be honoured on Windows slave Open Unresolved Resolved Cannot Reproduce
5912 "Could not clone" error and SSH key setup Open Unresolved Resolved Cannot Reproduce
5935 Improve equals method for warnings Open Unresolved Closed Duplicate
5938 Windows Server 2008 support Open Unresolved Resolved Not A Defect
5947 SVN external folders are empty after checkout Open Unresolved Resolved Cannot Reproduce
5980 Jobs marked as succesful even though SVN couldn't be polled because password changed Open Unresolved Resolved Cannot Reproduce
6012 Hash (#) character in HUDSON_HOME HTTP password is not possible Open Unresolved Resolved Cannot Reproduce
6016 Subversion plugin triggers build, even if there is no change Open Unresolved Resolved Cannot Reproduce
6026 "runk/file" (missing 't') paths from getAffectedPaths() Open Unresolved Resolved Cannot Reproduce
6031 Build parameters not passed correctly into build step Open Unresolved Resolved Cannot Reproduce
6037 When using slaves, Hudson master do not give to them information on certificates for Subversion access Open Unresolved Resolved Cannot Reproduce
6044 revision check failed Open Unresolved Resolved Cannot Reproduce
6051 Deleting a job with 'quite period' option set does not wake up downstream jobs Open Unresolved Resolved Cannot Reproduce
6090 Deadlock in hudson.model.View.getQueueItems on startup Open Unresolved Resolved Cannot Reproduce
6099 Add cancel all UI element to Build Queue table Open Unresolved Verified Fixed
6102 Cannot submit forms in Opera Open Unresolved Resolved Cannot Reproduce
6119 The date used on the CVS -D option is converted to UTC but our CVS server and/or client doesn't use UTC time Open Unresolved Resolved Cannot Reproduce
6138 During subversion initial checkout/update, the checkout/update takes a really long time and the parent HUDSON process keeps spawning a secondary child process that only lives a few seconds before terminating Open Unresolved Resolved Cannot Reproduce
6175 Accurev changelog fails with return code 1 Open Unresolved Closed Duplicate
6177 Plus icon under "Build Artifacts" doesn't expand to show all files in directory Open Unresolved Resolved Cannot Reproduce
6198 plugin should warn when unable to determine available servers Open Unresolved Closed Duplicate
6201 Add ability to specify top-level stream for update checking. Open Unresolved Closed Duplicate
6203 Git plugin uses default encoding to read change log file Reopened Unresolved Resolved Fixed
6204 Tomcat won't shutdown due to "stdout copier" threads with no active jobs Open Unresolved Resolved Cannot Reproduce
6211 Downstream build view not working Open Unresolved Resolved Cannot Reproduce
6215 Hudson.getInstance().getRootUrl() returns incorrect URL if Hudson is running on different prot. Open Unresolved Resolved Cannot Reproduce
6230 Display job-description also on parameters page when starting a parametrized job Open Unresolved Verified Fixed
6240 Allow Accurev plugin to poll for changes in the subdirectory Open Unresolved Closed Duplicate
6241 Hudson Nodes Discconnect for no apparent reason Open Unresolved Resolved Cannot Reproduce
6275 improve jelly development by indicating which jelly file rendered an element Open Unresolved Resolved Fixed
6281 SVN checkout takes very long on Tomcat with 64bit-JVM Reopened Unresolved Resolved Cannot Reproduce
6290 Add a "New View" link in the sidebar of Hudson Open Unresolved Verified Fixed
6296 Remote API /computer/api/xml fails when the offlinecause is an EOFException Open Unresolved Resolved Cannot Reproduce
6312 cvs log error Open Unresolved Verified Cannot Reproduce
6322 LDAP group search should include additional objectclass In Progress Unresolved Resolved Cannot Reproduce
6329 Build fails with "Unable to delete ...config.xml" which is read-only for a period when read through API Open Unresolved Resolved Cannot Reproduce
6338 Job's cyclic dependency not detected Open Unresolved Resolved Cannot Reproduce
6354 test history graphs can be generated without any y labels, providing minimal meaning Open Unresolved Resolved Cannot Reproduce
6368 SVN plugin is not supported by github.com Open Unresolved Resolved Cannot Reproduce
6373 Launch agent from browser on slave fails Open Unresolved Resolved Cannot Reproduce
6376 "Project-based Matrix Authorization Strategy" Will Not Keep User Logged In Open Unresolved Resolved Cannot Reproduce
6400 schedule triggering not working sometimes Open Unresolved Resolved Cannot Reproduce
6415 invalid svn:externals warnings are swallowed silently and ignored during checkout Open Unresolved Resolved Cannot Reproduce
6423 Bounds exceeds available space exception after successful build Open Unresolved Resolved Cannot Reproduce
6443 AggregatedTestResultPublisher$TestResultAction cannot be cast to hudson.tasks.test.TestResult Open Unresolved Resolved Cannot Reproduce
6446 Unit test rules should be symmetric Open Unresolved Closed Won't Fix
6475 Bazaar plugin requires write access to the master Hudson home path on SSH slaves Open Unresolved Resolved Cannot Reproduce
6479 Migration from Master to master-slave and Subversion checkout. Open Unresolved Resolved Cannot Reproduce
6481 svn 503 Service Unavailable error Open Unresolved Resolved Cannot Reproduce
6485 Accurev sometimes fails to export the ACCUREV_LAST_TRANSACTION variable, causing build to fail Open Unresolved Closed Duplicate
6489 Windows XP master + IE7 connecting to Unix slaves don't show NL in log files? Open Unresolved Resolved Cannot Reproduce
6492 Changing slave label doesn't assign queued job with same label to the slave Open Unresolved Resolved Cannot Reproduce
6493 cannot authenticate to svnserve supporting only the PLAIN mechanism Open Unresolved Resolved Cannot Reproduce
6511 Subversion Authentication: Field for Private key does not allow file path on server to specified Open Unresolved Resolved Not A Defect
6528 request handler threads get stuck in WeakHashMap Open Unresolved Resolved Cannot Reproduce
6558 NegativeArraySizeException from ConsoleNote.readFrom after stopping build Open Unresolved Resolved Fixed
6571 Out Of Memory with most of the memory occupied by String: GC overhead limit exceeded Open Unresolved Resolved Cannot Reproduce
6585 htmlpublisher retains after start of hudson Open Unresolved Resolved Cannot Reproduce
6588 f:select does not get proper value inside f:repetable Open Unresolved Resolved Cannot Reproduce
6590 Backslashes at the end of custom workspace names are truncated Open Unresolved Verified Cannot Reproduce
6604 Possible race condition in RemoteClassLoader renders slave unusable Open Unresolved Resolved Cannot Reproduce
6614 java.io.IOException: Operation not permitted on start hudson 1.359 Reopened Unresolved Resolved Cannot Reproduce
6617 Don't count mis-configured builds in ci-game Open Unresolved Closed Won't Fix
6627 SVN Triggers continously if update failesdue to broken working copy Open Unresolved Resolved Cannot Reproduce
6629 Cannot restart Hudson from the web frontend on OpenSolaris in VirtualBox Open Unresolved Verified Fixed
6651 Hudson crashes for unknown reasons Open Unresolved Resolved Cannot Reproduce
6654 Hudson hangs on "please wait" page (DNSMultiCast?) Open Unresolved Resolved Cannot Reproduce
6675 Invalid number of new warnings detected Open Unresolved Closed Duplicate
6677 Dead thread without config parameters Open Unresolved Resolved Cannot Reproduce
6678 Workspace input field allows unwanted access to content outside of the workspace Open Unresolved Resolved Cannot Reproduce
6692 Timeline should use server's timezone, not GMT Reopened Fixed Verified Fixed
6697 Too many multicast dns answers Open Unresolved Resolved Cannot Reproduce
6718 Fatal error when you use a slave and try to launch command which need to be in the path after build (after "channel stopped"). Open Unresolved Resolved Cannot Reproduce
6727 Subversion Release Manager plugin run builds for teh same revision Open Unresolved Resolved Cannot Reproduce
6736 Maven proxy settings alters the hudson proxy settings Open Unresolved Resolved Cannot Reproduce
6746 build revision is wrong/confusing when last changed is different Open Unresolved Resolved Cannot Reproduce
6748 Analysis of Checkstyle Warnings per User Open Unresolved Closed Duplicate
6749 Hudson matrix job fails on Git checkout Open Unresolved Resolved Cannot Reproduce
6760 Hudson safe restart fails to restart Jetty Open Unresolved Resolved Cannot Reproduce
6773 java.io.IOException: Unable to delete (path to) config.xml Open Unresolved Resolved Cannot Reproduce
6783 XML API unable to retrieve children data from matrix build after hudson 1.362 Reopened Unresolved Resolved Postponed
6800 Cannot create/start slave using SSH with master and slave running windows Open Unresolved Resolved Cannot Reproduce
6810 hudson doesn't run on clean jboss due to class cast exeption Open Unresolved Verified Cannot Reproduce
6812 Enable to checkout different modules with different release tags Open Unresolved Resolved Cannot Reproduce
6817 FATAL: hudson.remoting.RequestAbortedException: java.io.IOException: Unexpected termination of the channel Open Unresolved Resolved Fixed
6819 Jobs are triggered twice occasionally Reopened Unresolved Verified Fixed
6833 Internal server error with matrix based authentication and HTTP basic authentication Open Unresolved Resolved Cannot Reproduce
6864 LDAP Group, Project based Matrix Rights, wrong enforcement Open Unresolved Resolved Cannot Reproduce
6902 Errors fetching from remote repos don't fail the build Reopened Unresolved Resolved Cannot Reproduce
6903 SCM Update leads to builds on every build processor Open Unresolved Resolved Cannot Reproduce
6906 BUILD_NUMBER not set Open Unresolved Resolved Cannot Reproduce
6907 Add ability to disable/change rule point values Open Unresolved Closed Won't Fix
6909 Create alias commands to IM bot and custom output Open Unresolved Closed Won't Fix
6910 Changesets are lost when builds fail Open Unresolved Resolved Cannot Reproduce
6916 Hudson waits forever if a slave is offline Open Unresolved Resolved Cannot Reproduce
6918 optionalBlock tag is not initialized correctly when declared within a radioBlock Open Unresolved Resolved Cannot Reproduce
6921 deleting project with a queued build leaves build in queue Open Unresolved Resolved Cannot Reproduce
6926 Test Results ignore skipped modules in Maven incremental build job Open Unresolved Resolved Cannot Reproduce
6933 TFS plugin does not support the -proxy TFS switch. Open Unresolved Closed Won't Fix
6934 Dead lock detected in java stack trace Open Unresolved Resolved Cannot Reproduce
6957 Windows slave fails to find java Open Unresolved Resolved Cannot Reproduce
6963 CGit browser support. Open Unresolved Resolved Fixed
6973 Make it possible to activate this globally for all jobs Open Unresolved Closed Won't Fix
6980 Add ability to specify if sidebar link should open in new window or same window Open Unresolved Closed Postponed
6981 Problem with Windows Slave using JNLP Agent Open Unresolved Resolved Cannot Reproduce
7005 SVN fails to checkout from github.com Open Unresolved Resolved Cannot Reproduce
7009 working copy partly locked Open Unresolved Resolved Cannot Reproduce
7013 Build fails to archive the artifacts Reopened Unresolved Resolved Fixed
7025 Workspace permissions don't work with Project-based Matrix Authorization Strategy Open Unresolved Deleted Deleted
7047 DNS Multicast announcement appears to only happen at startup Open Unresolved Resolved Cannot Reproduce
7049 Windows XP slave connection terminated repeatedly Open Unresolved Resolved Cannot Reproduce
7061 Plugin/extension handling improvements Open Unresolved Verified Fixed
7066 Glassfishv3 domain stops when using Hudson job to start the Glassfishv3 domain Open Unresolved Resolved Cannot Reproduce
7084 Unable to cancel build done on slave that disconnected Open Unresolved Resolved Cannot Reproduce
7096 User is created even if invalid or missing information is typed Open Unresolved Resolved Cannot Reproduce
7097 Can't delete user Open Unresolved Resolved Cannot Reproduce
7098 Sidepanel uses non-absolutelinks Open Unresolved Resolved Cannot Reproduce
7129 DNSMultiCast causes startup failure from 1.359 Open Unresolved Resolved Cannot Reproduce
7135 No such file or directory error when project contains space (no container is used) Open Unresolved Resolved Cannot Reproduce
7140 Copy artifacts fails, still build successful Open Unresolved Resolved Cannot Reproduce
7144 Mark warnings with an inspection status Open Unresolved Closed Duplicate
7175 Intermittent log messages while unregistering Hudson app/stopping Tomcat ... Open Unresolved Resolved Cannot Reproduce
7178 Hudson Warning Plugin crash, java.lang.StackOverflowError Open Unresolved Closed Duplicate
7210 Add an additional symlink to the current running or last build Open Unresolved Resolved Fixed
7217 Clean Workspace only cleans the most recent slave Open Unresolved Resolved Cannot Reproduce
7225 SVN revert does not function properly on slave nodes Open Unresolved Resolved Cannot Reproduce
7228 Archiving artifacts does not preserve timestamps Open Unresolved Resolved Cannot Reproduce
7248 Matrix-Job configuration did not recognise if node was deleted Open Unresolved Resolved Cannot Reproduce
7251 ListView.contains method does not work when using regexp or job filters Open Unresolved Resolved Cannot Reproduce
7278 infinite redirect loop when proxying with security enabled Open Unresolved Resolved Cannot Reproduce
7291 Flyweight jobs and zero executors Open Unresolved Resolved Cannot Reproduce
7311 Upgrade groovy from 1.6.0 to 1.7.x Open Unresolved Resolved Not A Defect
7317 descriptorRadioList inside rowSet gets wrong @nameref Open Unresolved Resolved Cannot Reproduce
7329 1.368: builds get slower as the day goes on. Open Unresolved Resolved Cannot Reproduce
7346 Git fetch fails on Cygwin with "remote end hung unexpectedly" Open Unresolved Resolved Cannot Reproduce
7349 org.tmatesoft.svn.core.SVNException: svn: PROPFIND of '/repo/xxx': 405 Method Not Allowed (https://svn.xxx.de) Open Unresolved Resolved Cannot Reproduce
7363 Improve label choice to provide both dropdown (for simple) and textbox (for complex) Open Unresolved Verified Fixed
7371 Lock on startup (possibly related to the libvirt plugin) Open Unresolved Resolved Cannot Reproduce
7379 Hudson hangs on shutdown Open Unresolved Closed Cannot Reproduce
7391 "hudson.util.IOException2: Failed to join the process" during MSBuild task Open Unresolved Resolved Cannot Reproduce
7407 CVSROOT with proxy is flagged as Invalid CVSROOT string Open Unresolved Resolved Cannot Reproduce
7411 Slave environment variables are not used during Git Polling Reopened Unresolved Resolved Cannot Reproduce
7414 Git submodules support does not work with relative url path Open Unresolved Resolved Cannot Reproduce
7423 Git doesn't execute concurrent builds if necessary Open Unresolved Resolved Cannot Reproduce
7426 CLONE -SMTP authentication not working Open Unresolved Verified Fixed
7443 Feature to delete the user setting of trend graph preserved in the cookie. Open Unresolved Closed Duplicate
7449 Cvs SCM checks out more than listed in Modules Open Unresolved Verified Fixed
7474 Environment variables defined in node configuration disappearing (not set) when system under load Open Unresolved Resolved Cannot Reproduce
7477 Problem that user who cannot delete it from management Web screen can be made Open Unresolved Resolved Cannot Reproduce
7478 Wrong EOL (UNIX type: LF) in Windows batch files executed for build steps of type "Execute Windows batch command" Open Unresolved Resolved Cannot Reproduce
7482 Per Project Leader Board Open Unresolved Closed Won't Fix
7488 CLONE -java.io.IOException: Unable to delete <FOLDER_NAME> - files in dir: [<WEB_REFERENCE_FILE>] Open Unresolved Resolved Cannot Reproduce
7501 POST'ing a config.xml to create a new job via the XML API results in newlines being removed from XML elements containing them (ant build steps, winbatch steps, etc) Open Unresolved Resolved Cannot Reproduce
7517 Data from f:dropdownList in a global.jelly is not named properly in JSON data Open Unresolved Resolved Cannot Reproduce
7518 CLONE -Crumb breaks ajax request behind proxies. – Still broken behind nginx proxies Reopened Unresolved Resolved Fixed
7533 Build rss feeds changed, status text from 'SUCCESS' to 'stable' Open Unresolved Resolved Not A Defect
7541 /createItem fails to create intermediate directories Open Unresolved Resolved Cannot Reproduce
7554 GIT_BRANCH not set when multiple branches are selected for build Open Unresolved Resolved Fixed
7568 When using TFS in a slave configuration the Error."There's no such executable C:\Program Files\Microsoft Visual Studio 9.0\Common7\IDE\tf.exe in PATH: /sbin, /usr/sbin, /bin, /usr/bin." is shown in Manage hudson screen Open Unresolved Closed Won't Fix
7573 Hudson not translating variable name when creating directory for SVN checkout Open Unresolved Resolved Cannot Reproduce
7586 Null Pointer in EmmaPublisher Open Unresolved Resolved Fixed
7593 Master Slave connection error Open Unresolved Resolved Fixed
7601 Global configuration options not displayed Open Unresolved Closed Won't Fix
7609 auto-installation of maven fails when many builds trigger at the same time Open Unresolved Resolved Cannot Reproduce
7613 SVN checkout from a slave hangs with 1.378, reverting to 1.376 resolves the issue. Open Unresolved Resolved Cannot Reproduce
7623 hudson build console output produces outofmemory Open Unresolved Verified Cannot Reproduce
7628 Resolve naming inconsistencies in hudson interface - terminology Open Unresolved Resolved Cannot Reproduce
7639 SVN "authentication cancelled" despite deletion of Subversion\auth folder Open Unresolved Resolved Cannot Reproduce
7641 Slaves hang when archiving artifacts Open Unresolved Resolved Cannot Reproduce
7651 Clearcase plugin null value for view name when site goal is called for submodules Reopened Unresolved Resolved Fixed
7653 Apparently aborted build w/ incomplete artifacts marked as "stable" Open Unresolved Verified Fixed
7655 Another case of frozen build Open Unresolved Verified Fixed
7667 Build waits for next available executor even if several are available Open Unresolved Resolved Cannot Reproduce
7669 Hudson executes multiple Builds the same time Open Unresolved Resolved Cannot Reproduce
7671 Jobs are failing after successful build process Open Unresolved Verified Cannot Reproduce
7673 Hudson not terminating child processes on Windows slave Open Unresolved Resolved Cannot Reproduce
7678 Frozen build after channel stopped Open Unresolved Resolved Cannot Reproduce
7682 email not sent Open Unresolved Resolved Cannot Reproduce
7685 Raw console output does not work Open Unresolved Resolved Cannot Reproduce
7696 INFO: I/O exception (java.net.SocketException) caught when processing request: Too many open files Open Unresolved Resolved Incomplete
7710 500 Internal Server Error when try to build a new job Open Unresolved Resolved Cannot Reproduce
7737 403 on https://hudson/loginEntry?from=/ but login is OK Open Unresolved Resolved Cannot Reproduce
7738 Gerrit notification issue due to parameter extraction failure Open Unresolved Closed Fixed
7742 git hangs in Hudson Open Unresolved Resolved Cannot Reproduce
7744 Aborting job fails to kill processes started during cancel action Open Unresolved Resolved Cannot Reproduce
7746 Killing processes on Mac OS X/64bit VM does not work Open Unresolved Resolved Fixed
7763 git polling can trigger two builds for one commit Open Unresolved Resolved Cannot Reproduce
7780 Recursion and crash when archiving from workspace that contains symlinks Open Unresolved Resolved Cannot Reproduce
7788 Build Console not displayed due to Java Heap OutOfMemoryError Open Unresolved Verified Cannot Reproduce
7791 CLI authenticated mode not working Open Unresolved Resolved Cannot Reproduce
7792 Force build does not do Subversion polling Open Unresolved Resolved Cannot Reproduce
7793 Failed to launch slave to Windows 7 while all config steps done Open Unresolved Resolved Cannot Reproduce
7812 renaming a project is not propagated to slave nodes Open Unresolved Resolved Cannot Reproduce
7813 Archiving artifacts very slow Open Unresolved Verified Fixed
7820 OutOfMemoryError when parsing junitResult.xml Open Unresolved Resolved Cannot Reproduce
7822 Maven settings file not found (concurrent build of same project) Open Unresolved Resolved Cannot Reproduce
7823 Wrong Permission of slave workspace Open Unresolved Resolved Cannot Reproduce
7825 Cannot restrict a matrix build job to one node/label Open Unresolved Resolved Fixed
7827 Workspace cleared randomly causing jobs to fail Open Unresolved Resolved Cannot Reproduce
7833 Hudson fails to calculate changelog with CVS 1.12 Open Unresolved Resolved Fixed
7840 High CPU load - possible endless loop - could be consoleText GET related Open Unresolved Resolved Cannot Reproduce
7847 Hudson logs out users when entering configure screen Open Unresolved Resolved Cannot Reproduce
7852 The git plugin does not show commit descriptions in the changelog Open Unresolved Resolved Cannot Reproduce
7865 Weird scrollbar in Dashboard when viewed with Chrome Open Unresolved Resolved Cannot Reproduce
7872 Cannot launch a slave as a Windows service on a Win7 VM instance Open Unresolved Resolved Cannot Reproduce
7880 HTTP request for checkArtifacts hangs Hudson for a long time on large workarea Open Unresolved Verified Fixed
7882 Console log can throw OutOfMemoryError if it contains a malformed ConsoleNote Open Unresolved Verified Cannot Reproduce
7885 Reloading configuration leads to lost build status Open Unresolved Resolved Cannot Reproduce
7892 Support TestCase attribute patch. Open Unresolved Closed Won't Fix
7895 jobs do not start Open Unresolved Verified Cannot Reproduce
7903 Unable to load winp.x64.dll Open Unresolved Resolved Fixed
7906 cvs checkout failure runs jdepend even though nothing was build Open Unresolved Resolved Cannot Reproduce
7920 Access denied when copy files from a network computer in Windows batch script Open Unresolved Resolved Cannot Reproduce
7921 Archiving very slow between slave and master in unix driven by ssh Open Unresolved Resolved Cannot Reproduce
7926 Add time execution of the build on build detail page Open Unresolved Verified Fixed
7955 Error when checkouting on cvs Open Unresolved Resolved Cannot Reproduce
7976 Aggregate downstream test results does not work for Matrix projects Open Unresolved Resolved Cannot Reproduce
7979 CLONE -SVN "authentication cancelled" despite deletion of Subversion\auth folder Open Unresolved Resolved Cannot Reproduce
7980 artifact deployment runs shell commands without proper quoting Open Unresolved Resolved Cannot Reproduce
7984 notifyCommit holds changes for about an hour after Hudson restart Open Unresolved Resolved Cannot Reproduce
7990 NPE during at hudson.remoting.ProxyOutputStream._write(ProxyOutputStream.java:118) Open Unresolved Resolved Fixed
7991 Not possible to reach people / user screen null pointer exception Open Unresolved Verified Cannot Reproduce
7996 Job run hangs during SVN update Open Unresolved Resolved Cannot Reproduce
8000 Snapshots: "Deploy artifacts to Maven repository" doesn't work with "sources" classifier associated Open Unresolved Resolved Cannot Reproduce
8008 Clone workspace deadlocks around FilePath.unzip Open Unresolved Resolved Cannot Reproduce
8013 Baseline listbox suggestion In Progress Unresolved Closed Fixed
8015 Baseline GUI suggestion Open Unresolved Closed Fixed
8019 When hudson is a private build, the version check for plugin updates doesn't work Open Unresolved Resolved Cannot Reproduce
8028 Plugin update installer downloads "302 redirect" response as the .hpi file, then reports success. Open Unresolved Resolved Cannot Reproduce
8031 Local workspace not deleted on project path, etc. change when "use update" is checked Open Unresolved Closed Won't Fix
8044 displaying line.separator without any quoting doesn't make sense Open Unresolved Verified Fixed
8045 Weird log display behavior for too fast workerThread in TaskAction Open Unresolved Resolved Cannot Reproduce
8053 Sync mechanism between SCM polling and node availability Open Unresolved Closed Duplicate
8055 Ressurected slave marked as dead although it's online Open Unresolved Resolved Cannot Reproduce
8059 Subversion Plugin does break native svn command line authentication, credentials missing after rewriting auth cache file Reopened Unresolved Verified Fixed
8066 upgrade from 1.383 to 1.384 lost my build history Open Unresolved Resolved Cannot Reproduce
8068 Post-commit hook does not trigger if project is configured to check out from the top of a repository Open Unresolved Resolved Cannot Reproduce
8082 git plugin multi-repo can't work Open Unresolved Verified Fixed
8099 org.jvnet.hudson.reactor.ReactorException: hudson.util.IOException2: Unable to read D:\config.xml Open Unresolved Resolved Cannot Reproduce
8112 Matrix jobs' build duration includes time when the job was waiting for executors Open Unresolved Resolved Cannot Reproduce
8122 git plugin: tags from submodules are incorrectly fetched into parent repository Open Unresolved Resolved Cannot Reproduce
8123 /createItem mode=copy creates a copy that won't build Open Unresolved Resolved Cannot Reproduce
8128 Tagging a build is not working Open Unresolved Resolved Cannot Reproduce
8145 Unable to store/handle new credentials with subversion plugin 1.2x Open Unresolved Resolved Cannot Reproduce
8147 Execute concurrent builds on one executer fails Open Unresolved Verified Fixed
8149 Git submodule fetch uses (incorrect) parent refspec Open Unresolved Resolved Cannot Reproduce
8152 LDAP config error Open Unresolved Resolved Cannot Reproduce
8154 broken pipe when visiting the index page Open Unresolved Resolved Cannot Reproduce
8157 Hudson executes Post-build actions, before build actions are complete. Open Unresolved Resolved Cannot Reproduce
8158 New snapshot creation feature can cause SCM-checkout-retry mechanism to fail Open Unresolved Closed Duplicate
8159 hudson debian pkg install failed on ubuntu 10.04 LTS due to java-virtual-machine dependency Reopened Unresolved Verified Fixed
8166 hudson.util.IOException2: remote file operation failed Open Unresolved Resolved Cannot Reproduce
8177 Archiving artifacts from Windows dumb-slaves to a Windows server is very slow Open Unresolved Resolved Cannot Reproduce
8181 Subversion plugin client certificate authentication fails with blank username, password Open Unresolved Resolved Cannot Reproduce
8183 ssh connection failed when login banner is too long In Progress Unresolved Resolved Cannot Reproduce
8209 Update hudson.Util.VARIABLE to support variable names with a '.' in them In Progress Unresolved Resolved Fixed
8212 Multi-configuration job occasionally fails under reproducible hammered conditions Open Unresolved Resolved Cannot Reproduce
8213 links generated for WebSVN don't work with 2.3.1 Open Unresolved Resolved Cannot Reproduce
8214 Try to access to a private URL returns a 404 instead of a 401 Open Unresolved Closed Cannot Reproduce
8217 Ant Setting aren't reloaded form the hudson.tasks.Ant.xml Open Unresolved Resolved Cannot Reproduce
8223 flaky slave assignment Open Unresolved Resolved Cannot Reproduce
8238 Improve nestedview management by adding some buttons / links Open Unresolved Closed Postponed
8241 Performance problem : CPU at 100% and IHM not available for over than 1 hour Open Unresolved Resolved Fixed
8242 Thread cannot be close when shuting down tomcat Open Unresolved Resolved Cannot Reproduce
8264 Allow Hudson parameter expansion in stream name Open Unresolved Closed Duplicate
8273 java.io.EOFException when running AccuRev streams command Open Unresolved Closed Duplicate
8277 Impossible to create a task with create right without configure. Open Unresolved Resolved Not A Defect
8284 Hung build which is non-killable Open Unresolved Resolved Cannot Reproduce
8291 Bad user data in runtime job parameters Open Unresolved Verified Fixed
8304 Hudson shouldn't let Triggers block indefinitely Open Unresolved Resolved Cannot Reproduce
8312 svn:externals not being checked out Open Unresolved Resolved Cannot Reproduce
8316 restart button does nothing Open Unresolved Resolved Cannot Reproduce
8321 Windows service restarts fail Open Unresolved Resolved Cannot Reproduce
8324 Urlchangetrigger should have a timeout on its connections Open Unresolved Resolved Cannot Reproduce
8329 UTF-8 characters turn to question marks in slave log, display correctly in master log Open Unresolved Resolved Cannot Reproduce
8330 OutOfMemory - Status Code: 500 Open Unresolved Resolved Cannot Reproduce
8340 The symbolic link lastStable points to lastSuccessful, ordinary maven2 project Open Unresolved Verified Fixed
8351 Hudson doesn't save the setting "TCP port for the JNLP slave agents" if settings in the Access Control section are not modified Open Unresolved Resolved Not A Defect
8358 A disabled project is always DISABLED even is the project is building Open Unresolved Resolved Cannot Reproduce
8377 Build step for Robot Open Unresolved Closed Duplicate
8378 Filter test chart Open Unresolved Closed Duplicate
8380 Allow clean shutdown of testing from UI Open Unresolved Closed Duplicate
8381 Robot summary and trend graph for multi-configuration project Open Unresolved Closed Duplicate
8384 Copying a compressed tar file from a 64 bit master to a slave running SUSE Linux fails Open Unresolved Resolved Cannot Reproduce
8404 Java heap space when recording the JUnit test results Open Unresolved Resolved Cannot Reproduce
8408 Large number of jobs triggered on Hudson restart Open Unresolved Closed Won't Fix
8431 'Filter build executors' not working for multi-configuration jobs Open Unresolved Resolved Cannot Reproduce
8432 The plugin capture tags in strings Open Unresolved Closed Duplicate
8437 can't cancel builds during long git merge Open Unresolved Resolved Cannot Reproduce
8440 subversion plugin incorrectly reports 'no changes' if previous checkout/update fails Open Unresolved Resolved Cannot Reproduce
8463 missing attached Hudson sources and javadocs in Maven repository Open Unresolved Closed Fixed
8464 junit test execution using ssh launcher fails with NoSuchMethodError Open Unresolved Resolved Cannot Reproduce
8467 Run handle.exe with /accepteula switch to avoid headless hangs Open Unresolved Closed Won't Fix
8468 NPE during fixing of old data Open Unresolved Resolved Cannot Reproduce
8477 Random failure to find bash on Windows/Cygwin slave Open Unresolved Resolved Cannot Reproduce
8495 svn:external version differs in build log and in build's 'revisions' section Open Unresolved Resolved Cannot Reproduce
8499 windows batch command cannot redirect output to file Open Unresolved Verified Cannot Reproduce
8503 Git submodules are cloned too early and not removed once the revToBuild has been checked out Open Unresolved Resolved Cannot Reproduce
8542 Hudson fails to perform SVN checkout if CPU affinity is set Open Unresolved Resolved Cannot Reproduce
8554 SCM polling always return true when using specific revision in svn Open Unresolved Verified Fixed
8581 Error when using track svn plugin Open Unresolved Resolved Cannot Reproduce
8587 Exception in thread "main" java.lang.NoClassDefFoundError Reopened Unresolved Closed Duplicate
8595 How to disable a bundled plugin? Open Unresolved Resolved Cannot Reproduce
8598 Hudsod failed to start when unable to read queue.xml Open Unresolved Resolved Cannot Reproduce
8600 allow adding sidebar links to build pages Open Unresolved Closed Postponed
8611 SCM config in job shows more options with JavaScript deactivated Open Unresolved Closed Duplicate
8614 ProcessTreeTest fails on Windows Open Unresolved Verified Fixed
8627 Can't get slave to work on Windows 7 using 1.395 or older version 1.389 (with Linux master) Open Unresolved Resolved Cannot Reproduce
8633 Exception when clicking on "My Views" on left hand menue for particular user Open Unresolved Resolved Cannot Reproduce
8646 Deleting workspace via jobs gui throws exception Open Unresolved Resolved Cannot Reproduce
8650 Report is not picked up when executing Maven goal "verify" Open Unresolved Closed Duplicate
Enter labels to add to this page:
Please wait 
Looking for a label? Just start typing.